Target
Prothrombin
Ligand
BDBM50142140
Substrate
Meas. Tech.
ChEBML_208119
IC50
>11000±n/a nM
Citation
 Zhang, PBao, LZuckett, JFJia, ZJWoolfrey, JArfsten, AEdwards, SSinha, UHutchaleelaha, ALambing, JLHollenbach, SJScarborough, RMZhu, BY Design, synthesis, and SAR of anthranilamide-based factor Xa inhibitors with improved functional activity. Bioorg Med Chem Lett 14:989-93 (2004)  
Target
Name:
Prothrombin
Synonyms:
Activation peptide fragment 1 Coagulation factor II Prothrombin precursor Thrombin heavy chain | Thrombin light chain
Type:
Protein
Mol. Mass.:
70029.57
Organism:
Homo sapiens (Human)
Description:
P00734
Residue:
622
  
Inhibitor
Name:
BDBM50142140
Synonyms:
5-Chloro-N-(5-chloro-pyridin-2-yl)-2-[4-(4-hydroxy-piperidin-1-ylmethyl)-benzoylamino]-benzamide | CHEMBL174740
Type:
Small organic molecule
Emp. Form.:
C25H24Cl2N4O3
Mol. Mass.:
499.389
SMILES:
OC1CCN(Cc2ccc(cc2)C(=O)Nc2ccc(Cl)cc2C(=O)Nc2ccc(Cl)cn2)CC1
: