Target
Serine protease 1
Ligand
BDBM50142168
Substrate
Meas. Tech.
ChEBML_212711
IC50
>11000±n/a nM
Citation
 Zhang, PBao, LZuckett, JFJia, ZJWoolfrey, JArfsten, AEdwards, SSinha, UHutchaleelaha, ALambing, JLHollenbach, SJScarborough, RMZhu, BY Design, synthesis, and SAR of anthranilamide-based factor Xa inhibitors with improved functional activity. Bioorg Med Chem Lett 14:989-93 (2004)  
Target
Name:
Serine protease 1
Synonyms:
Alpha-trypsin chain 1 Beta-trypsin PRSS1 TRP1 TRY1_HUMAN Thrombin & trypsin Trypsin I | Trypsin-1
Type:
Enzyme
Mol. Mass.:
26557.80
Organism:
Homo sapiens (Human)
Description:
P07477
Residue:
247
  
Inhibitor
Name:
BDBM50142168
Synonyms:
5-Chloro-N-(5-chloro-pyridin-2-yl)-2-(4-diethylaminomethyl-benzoylamino)-benzamide | CHEMBL174870
Type:
Small organic molecule
Emp. Form.:
C24H24Cl2N4O2
Mol. Mass.:
471.379
SMILES:
CCN(CC)Cc1ccc(cc1)C(=O)Nc1ccc(Cl)cc1C(=O)Nc1ccc(Cl)cn1
: