Target
Neuronal acetylcholine receptor subunit alpha-4/beta-2
Ligand
BDBM50119640
Substrate
Meas. Tech.
ChEMBL_143860 (CHEMBL748864)
Ki
0.025000±n/a nM
Citation
 Carroll, FI Epibatidine structure-activity relationships. Bioorg Med Chem Lett 14:1889-96 (2004)  
Target
Name:
Neuronal acetylcholine receptor subunit alpha-4/beta-2
Synonyms:
Neuronal acetylcholine receptor alpha4/beta2 Neuronal acetylcholine receptor; alpha4/beta2
Type:
Mol. Mass.:
Description:
Components:
This complex has 0 components.
Component 1
Name:
Neuronal acetylcholine receptor subunit alpha-4
Synonyms:
ACHA4_RAT Cholinergic, Nicotinic Alpha4Beta2 Chrna4 Neuronal acetylcholine receptor (alpha4beta2 nAChR) Neuronal acetylcholine receptor subunit alpha 4 beta 2 | Neuronal acetylcholine receptor subunit alpha-4
Type:
Enzyme
Mol. Mass.:
70196.44
Organism:
Rattus norvegicus (Rat)
Description:
P09483
Residue:
630
  
Component 2
Name:
Neuronal acetylcholine receptor subunit beta-2
Synonyms:
ACHB2_RAT Chrnb2 Neuronal acetylcholine receptor non-alpha-1 chain
Type:
Enzyme
Mol. Mass.:
56910.32
Organism:
Rattus norvegicus (Rat)
Description:
P12390
Residue:
500
  
Inhibitor
Name:
BDBM50119640
Synonyms:
2-(6-Chloro-5-fluoro-pyridin-3-yl)-7-aza-bicyclo[2.2.1]heptane | CHEMBL54686
Type:
Small organic molecule
Emp. Form.:
C11H12ClFN2
Mol. Mass.:
226.678
SMILES:
Fc1cc(cnc1Cl)[C@H]1CC2CCC1N2
: