Target
Squalene--hopene cyclase
Ligand
BDBM50143435
Substrate
Meas. Tech.
ChEBML_201951
IC50
70000±n/a nM
Citation
 Cravotto, GBalliano, GRobaldo, BOliaro-Bosso, SChimichi, SBoccalini, M Farnesyloxycoumarins, a new class of squalene-hopene cyclase inhibitors. Bioorg Med Chem Lett 14:1931-4 (2004)  
Target
Name:
Squalene--hopene cyclase
Synonyms:
SQHC_ALIAD Squalene-hopene cyclase | shc
Type:
PROTEIN
Mol. Mass.:
71559.28
Organism:
Alicyclobacillus acidocaldarius
Description:
ChEMBL_201951
Residue:
631
  
Inhibitor
Name:
BDBM50143435
Synonyms:
7-((2E,6E)-3,7,11-Trimethyl-dodeca-2,6,10-trienyloxy)-chromen-2-one | CHEMBL156127
Type:
Small organic molecule
Emp. Form.:
C24H30O3
Mol. Mass.:
366.4932
SMILES:
[#6]\[#6](-[#6])=[#6]\[#6]-[#6]\[#6](-[#6])=[#6]\[#6]-[#6]\[#6](-[#6])=[#6]\[#6]-[#8]-c1ccc2ccc(=O)oc2c1
: