Target
C-C chemokine receptor type 5
Ligand
BDBM50143762
Substrate
Meas. Tech.
ChEMBL_39497 (CHEMBL656492)
IC50
1.1±n/a nM
Citation
 Thoma, GNuninger, FSchaefer, MAkyel, KGAlbert, RBeerli, CBruns, CFrancotte, ELuyten, MMacKenzie, DOberer, LStreiff, MBWagner, TWalter, HWeckbecker, GZerwes, HG Orally bioavailable competitive CCR5 antagonists. J Med Chem 47:1939-55 (2004)  
Target
Name:
C-C chemokine receptor type 5
Synonyms:
C-C CKR-5 CC-CKR-5 CCR5 CCR5_HUMAN CHEMR13 HIV-1 fusion coreceptor
Type:
Enzyme
Mol. Mass.:
40540.21
Organism:
Homo sapiens (Human)
Description:
P51681
Residue:
352
  
Inhibitor
Name:
BDBM50143762
Synonyms:
(2,6-Dimethyl-phenyl)-[4'-methyl-4-(4-trifluoromethyl-phenylamino)-[1,4']bipiperidinyl-1'-yl]-methanone | CHEMBL58897
Type:
Small organic molecule
Emp. Form.:
C27H34F3N3O
Mol. Mass.:
473.5736
SMILES:
Cc1cccc(C)c1C(=O)N1CCC(C)(CC1)N1CCC(CC1)Nc1ccc(cc1)C(F)(F)F
: