Target
Cytochrome P450 2D6
Ligand
BDBM50143948
Substrate
Meas. Tech.
ChEBML_51740
Ki
600±n/a nM
Citation
 Ashwell, MALapierre, JMKaplan, ALi, JMarr, CYuan, J The design, preparation and SAR of novel small molecule sodium (Na(+)) channel blockers. Bioorg Med Chem Lett 14:2025-30 (2004)  
Target
Name:
Cytochrome P450 2D6
Synonyms:
CP2D6_HUMAN CYP2DL1 Cytochrome P450 2D6 (CYP2D6) P450-DB1
Type:
Protein
Mol. Mass.:
55774.82
Organism:
Homo sapiens (Human)
Description:
P10635
Residue:
497
  
Inhibitor
Name:
BDBM50143948
Synonyms:
1-Phenoxy-3-{4-[phenyl-(4-trifluoromethyl-phenyl)-methyl]-piperazin-1-yl}-propan-2-ol | CHEMBL60256
Type:
Small organic molecule
Emp. Form.:
C27H29F3N2O2
Mol. Mass.:
470.5266
SMILES:
OC(COc1ccccc1)CN1CCN(CC1)C(c1ccccc1)c1ccc(cc1)C(F)(F)F
: