Target
Sodium channel protein type 1/2/3 subunit alpha
Ligand
BDBM50143966
Substrate
Meas. Tech.
ChEMBL_202417 (CHEMBL805572)
IC50
76±n/a nM
Citation
 Ashwell, MALapierre, JMKaplan, ALi, JMarr, CYuan, J The design, preparation and SAR of novel small molecule sodium (Na(+)) channel blockers. Bioorg Med Chem Lett 14:2025-30 (2004)  
Target
Name:
Sodium channel protein type 1/2/3 subunit alpha
Synonyms:
Sodium channel alpha subunits; brain (Types I, II, III) | Sodium channel protein type I I alpha subunit
Type:
Mol. Mass.:
Description:
ASSAY_ID of EBI is 202416
Components:
This complex has 3 components.
Component 1
Name:
Sodium channel protein type 1 subunit alpha
Synonyms:
SCN1A_RAT Sodium (Site 1) Sodium channel protein type I alpha subunit Sodium channel protein, brain I subunit alpha Voltage-gated sodium channel subunit alpha Nav1.1
Type:
PROTEIN
Mol. Mass.:
228753.20
Organism:
Rattus norvegicus
Description:
ChEMBL_938840
Residue:
2009
  
Component 2
Name:
Sodium channel protein type 2 subunit alpha
Synonyms:
SCN2A_RAT Scn2a1 Sodium channel protein type 2 subunit alpha Sodium channel protein type II subunit alpha Voltage-gated sodium channel | Voltage-gated sodium channel subunit alpha Nav1.2
Type:
PROTEIN
Mol. Mass.:
227854.11
Organism:
Rattus norvegicus
Description:
ChEMBL_1516893
Residue:
2005
  
Component 3
Name:
Sodium channel protein type 3 subunit alpha
Synonyms:
SCN3A_RAT Sodium channel protein type 3 subunit alpha Sodium channel protein type III subunit alpha Voltage-gated sodium channel Voltage-gated sodium channel subunit alpha Nav1.3
Type:
PROTEIN
Mol. Mass.:
221371.72
Organism:
Rattus norvegicus
Description:
ChEMBL_1516894
Residue:
1951
  
Inhibitor
Name:
BDBM50143966
Synonyms:
2-Chloro-N-[2-{4-[3-(4-fluoro-phenoxy)-2-hydroxy-propyl]-piperazin-1-yl}-2-(4-trifluoromethyl-phenyl)-ethyl]-benzenesulfonamide | CHEMBL64823
Type:
Small organic molecule
Emp. Form.:
C28H30ClF4N3O4S
Mol. Mass.:
616.067
SMILES:
OC(COc1ccc(F)cc1)CN1CCN(CC1)C(CNS(=O)(=O)c1ccccc1Cl)c1ccc(cc1)C(F)(F)F
: