Target
Cytochrome P450 2D6
Ligand
BDBM50143971
Substrate
Meas. Tech.
ChEBML_51740
Ki
2000±n/a nM
Citation
 Ashwell, MALapierre, JMKaplan, ALi, JMarr, CYuan, J The design, preparation and SAR of novel small molecule sodium (Na(+)) channel blockers. Bioorg Med Chem Lett 14:2025-30 (2004)  
Target
Name:
Cytochrome P450 2D6
Synonyms:
CP2D6_HUMAN CYP2DL1 Cytochrome P450 2D6 (CYP2D6) P450-DB1
Type:
Protein
Mol. Mass.:
55774.82
Organism:
Homo sapiens (Human)
Description:
P10635
Residue:
497
  
Inhibitor
Name:
BDBM50143971
Synonyms:
CHEMBL59644 | N-Benzyl-2-{4-[2-hydroxy-3-(4-methoxy-phenoxy)-propyl]-piperazin-1-yl}-2-(4-trifluoromethyl-phenyl)-acetamide
Type:
Small organic molecule
Emp. Form.:
C30H34F3N3O4
Mol. Mass.:
557.6039
SMILES:
COc1ccc(OCC(O)CN2CCN(CC2)C(C(=O)NCc2ccccc2)c2ccc(cc2)C(F)(F)F)cc1
: