Target
Cytochrome P450 2D6
Ligand
BDBM50143952
Substrate
Meas. Tech.
ChEBML_51740
Ki
700±n/a nM
Citation
 Ashwell, MALapierre, JMKaplan, ALi, JMarr, CYuan, J The design, preparation and SAR of novel small molecule sodium (Na(+)) channel blockers. Bioorg Med Chem Lett 14:2025-30 (2004)  
Target
Name:
Cytochrome P450 2D6
Synonyms:
CP2D6_HUMAN CYP2DL1 Cytochrome P450 2D6 (CYP2D6) P450-DB1
Type:
Protein
Mol. Mass.:
55774.82
Organism:
Homo sapiens (Human)
Description:
P10635
Residue:
497
  
Inhibitor
Name:
BDBM50143952
Synonyms:
CHEMBL59712 | N-{1-[2-Hydroxy-3-(4-methoxy-phenoxy)-propyl]-piperidin-4-yl}-4-methoxy-N-phenyl-benzamide
Type:
Small organic molecule
Emp. Form.:
C29H34N2O5
Mol. Mass.:
490.5907
SMILES:
COc1ccc(OCC(O)CN2CCC(CC2)N(C(=O)c2ccc(OC)cc2)c2ccccc2)cc1
: