Target
Delta-type opioid receptor
Ligand
BDBM50144230
Substrate
Meas. Tech.
ChEMBL_145310 (CHEMBL751916)
EC50
27±n/a nM
Citation
 Carson, JRCoats, SJCodd, EEDax, SLLee, JMartinez, RPNeilson, LAPitis, PMZhang, SP N,N-dialkyl-4-[(8-azabicyclo[3.2.1]-oct-3-ylidene)phenylmethyl]benzamides, potent, selective delta opioid agonists. Bioorg Med Chem Lett 14:2109-12 (2004)  
Target
Name:
Delta-type opioid receptor
Synonyms:
D-OR-1 Delta opioid receptor OPIATE Delta OPRD1 OPRK1 | opioid receptor, delta 1
Type:
G Protein-Coupled Receptor (GPCR)
Mol. Mass.:
40382.98
Organism:
Homo sapiens (Human)
Description:
Competition binding assays were carried out using membrane preparations from transfected HN9.10 cells that constitutively expressed the delta opioid receptor.
Residue:
372
  
Inhibitor
Name:
BDBM50144230
Synonyms:
CHEMBL67157 | N,N-Diethyl-4-[(4-methoxy-phenyl)-(8-methyl-8-aza-bicyclo[3.2.1]oct-3-ylidene)-methyl]-benzamide
Type:
Small organic molecule
Emp. Form.:
C27H34N2O2
Mol. Mass.:
418.5711
SMILES:
[#6]-[#6]-[#7](-[#6]-[#6])-[#6](=O)-c1ccc(cc1)-[#6](=[#6]-1\[#6]-[#6]-2-[#6]-[#6]-[#6](-[#6]-1)-[#7]-2-[#6])\c1ccc(-[#8]-[#6])cc1
: