Target
Mu-type opioid receptor
Ligand
BDBM50144230
Substrate
Meas. Tech.
ChEBML_149323
Ki
1499±n/a nM
Citation
 Carson, JRCoats, SJCodd, EEDax, SLLee, JMartinez, RPNeilson, LAPitis, PMZhang, SP N,N-dialkyl-4-[(8-azabicyclo[3.2.1]-oct-3-ylidene)phenylmethyl]benzamides, potent, selective delta opioid agonists. Bioorg Med Chem Lett 14:2109-12 (2004)  
Target
Name:
Mu-type opioid receptor
Synonyms:
M-OR-1 MOR-1 MUOR1 Mu opiate receptor OPRM1 hMOP | mu-type opioid receptor isoform MOR-1
Type:
G Protein-Coupled Receptor (GPCR)
Mol. Mass.:
44789.51
Organism:
Homo sapiens (Human)
Description:
P35372
Residue:
400
  
Inhibitor
Name:
BDBM50144230
Synonyms:
CHEMBL67157 | N,N-Diethyl-4-[(4-methoxy-phenyl)-(8-methyl-8-aza-bicyclo[3.2.1]oct-3-ylidene)-methyl]-benzamide
Type:
Small organic molecule
Emp. Form.:
C27H34N2O2
Mol. Mass.:
418.5711
SMILES:
[#6]-[#6]-[#7](-[#6]-[#6])-[#6](=O)-c1ccc(cc1)-[#6](=[#6]-1\[#6]-[#6]-2-[#6]-[#6]-[#6](-[#6]-1)-[#7]-2-[#6])\c1ccc(-[#8]-[#6])cc1
: