Target
Sigma non-opioid intracellular receptor 1
Ligand
BDBM50144508
Substrate
Meas. Tech.
ChEBML_201915
Ki
0.070000±n/a nM
Citation
 Glennon, RAIsmaiel, AMAblordeppey, SEl-Ashmawy, MFisher, JB Thioxanthene-derived analogs as sigma(1) receptor ligands. Bioorg Med Chem Lett 14:2217-20 (2004)  
Target
Name:
Sigma non-opioid intracellular receptor 1
Synonyms:
Aging-associated gene 8 protein SGMR1_HUMAN SIGMAR1 SR31747-binding protein Sigma 1-type opioid receptor Sigma1R | hSigmaR1
Type:
Enzyme Catalytic Domain
Mol. Mass.:
25124.85
Organism:
Homo sapiens (Human)
Description:
Q99720
Residue:
223
  
Inhibitor
Name:
BDBM50144508
Synonyms:
4-Methyl-1-(5-phenyl-pentyl)-piperidine | CHEMBL304079
Type:
Small organic molecule
Emp. Form.:
C17H27N
Mol. Mass.:
245.403
SMILES:
CC1CCN(CCCCCc2ccccc2)CC1
: