Target
Sigma non-opioid intracellular receptor 1
Ligand
BDBM50144515
Substrate
Meas. Tech.
ChEBML_201915
Ki
1.1±n/a nM
Citation
 Glennon, RAIsmaiel, AMAblordeppey, SEl-Ashmawy, MFisher, JB Thioxanthene-derived analogs as sigma(1) receptor ligands. Bioorg Med Chem Lett 14:2217-20 (2004)  
Target
Name:
Sigma non-opioid intracellular receptor 1
Synonyms:
Aging-associated gene 8 protein SGMR1_HUMAN SIGMAR1 SR31747-binding protein Sigma 1-type opioid receptor Sigma1R | hSigmaR1
Type:
Enzyme Catalytic Domain
Mol. Mass.:
25124.85
Organism:
Homo sapiens (Human)
Description:
Q99720
Residue:
223
  
Inhibitor
Name:
BDBM50144515
Synonyms:
1-(4,4-Diphenyl-butyl)-4-methyl-piperidine | CHEMBL71883
Type:
Small organic molecule
Emp. Form.:
C22H29N
Mol. Mass.:
307.4724
SMILES:
CC1CCN(CCCC(c2ccccc2)c2ccccc2)CC1
: