Target
Carbonic anhydrase 1
Ligand
BDBM11636
Substrate
Meas. Tech.
ChEBML_47520
Ki
10±n/a nM
Citation
 Abbate, FCasini, AScozzafava, ASupuran, CT Carbonic anhydrase inhibitors: X-ray crystallographic structure of the adduct of human isozyme II with a topically acting antiglaucoma sulfonamide. Bioorg Med Chem Lett 14:2357-61 (2004)  
Target
Name:
Carbonic anhydrase 1
Synonyms:
CA-I CAB Carbonate dehydratase I Carbonic anhydrase 1 (CA I) Carbonic anhydrase 1 (Recombinant CA I) Carbonic anhydrase B Carbonic anhydrase I (CA I) Carbonic anhydrase I (CAI) Carbonic anhydrase isoenzyme I (hCA I) | hCA
Type:
Enzyme
Mol. Mass.:
28873.37
Organism:
Homo sapiens (Human)
Description:
P00915
Residue:
261
  
Inhibitor
Name:
BDBM11636
Synonyms:
CHEMBL309431 Sulfonamide 3
Type:
Small organic molecule
Emp. Form.:
C15H22N6O5S3
Mol. Mass.:
462.567
SMILES:
CCN(CC)CCNC(=O)c1ccc(cc1)S(=O)(=O)Nc1nnc(s1)S(N)(=O)=O
: