Target
5-hydroxytryptamine receptor 2C
Ligand
BDBM50144840
Substrate
Meas. Tech.
ChEMBL_2970 (CHEMBL620618)
Ki
24±n/a nM
Citation
 Bentley, JMAdams, DRBebbington, DBenwell, KRBickerdike, MJDavidson, JEDawson, CEDourish, CTDuncton, MAGaur, SGeorge, ARGiles, PRHamlyn, RJKennett, GAKnight, ARMalcolm, CSMansell, HLMisra, AMonck, NJPratt, RMQuirk, KRoffey, JRVickers, SPCliffe, IA Indoline derivatives as 5-HT(2C) receptor agonists. Bioorg Med Chem Lett 14:2367-70 (2004)  
Target
Name:
5-hydroxytryptamine receptor 2C
Synonyms:
5-HT-2C 5-HT2C-INI 5-HTR2C 5-hydroxytryptamine receptor 2C (5-HT-2C) 5HT-1C HTR1C Serotonin (5-HT3) receptor Serotonin Receptor 2C
Type:
G Protein-Coupled Receptor (GPCR)
Mol. Mass.:
51836.79
Organism:
Homo sapiens (Human)
Description:
P28335
Residue:
458
  
Inhibitor
Name:
BDBM50144840
Synonyms:
(S)-2-(6-Bromo-2,3-dihydro-indol-1-yl)-1-methyl-ethylamine VER-3323
Type:
Small organic molecule
Emp. Form.:
C11H15BrN2
Mol. Mass.:
255.154
SMILES:
C[C@H](N)CN1CCc2ccc(Br)cc12
: