Target
Neuropeptide Y receptor type 5
Ligand
BDBM50145265
Substrate
Meas. Tech.
ChEBML_144155
IC50
23±n/a nM
Citation
 Rueeger, HGerspacher, MBuehlmayer, PRigollier, PYamaguchi, YSchmidlin, TWhitebread, SNuesslein-Hildesheim, BNick, HCricione, L Discovery and SAR of potent, orally available and brain-penetrable 5,6-dihydro-4H-3-thia-1-aza-benzo[e]azulen- and 4,5-dihydro-6-oxa-3-thia-1-aza-benzo[e]azulen derivatives as neuropeptide Y Y5 receptor antagonists. Bioorg Med Chem Lett 14:2451-7 (2004)  
Target
Name:
Neuropeptide Y receptor type 5
Synonyms:
NPY-Y5 NPY5-R NPY5R_HUMAN NPYY5 Neuropeptide Y receptor type 5 ( NPY Y5) | Y5 receptor
Type:
Enzyme
Mol. Mass.:
50746.64
Organism:
Homo sapiens (Human)
Description:
Q15761
Residue:
445
  
Inhibitor
Name:
BDBM50145265
Synonyms:
CHEMBL81000 | N-{4-[4-(4-Fluoro-phenyl)-thiazol-2-ylamino]-cyclohexylmethyl}-methanesulfonamide
Type:
Small organic molecule
Emp. Form.:
C17H22FN3O2S2
Mol. Mass.:
383.504
SMILES:
CS(=O)(=O)NC[C@H]1CC[C@@H](CC1)Nc1nc(cs1)-c1ccc(F)cc1
: