Target
Integrin alpha-V/beta-3
Ligand
BDBM50145527
Substrate
Meas. Tech.
ChEMBL_214632 (CHEMBL819712)
IC50
0.055000±n/a nM
Citation
 Iwama, SKitano, TFukuya, FHonda, YSato, YNotake, MMorie, T Discovery of a potent and selective alpha v beta 3 integrin antagonist with strong inhibitory activity against neointima formation in rat balloon injury model. Bioorg Med Chem Lett 14:2567-70 (2004)  
Target
Name:
Integrin alpha-V/beta-3
Synonyms:
ITGAV/ITGB3 | Integrin beta-3/Vitronectin receptor alpha
Type:
Enzyme
Mol. Mass.:
Description:
Components:
This complex has 2 components.
Component 1
Name:
Integrin alpha-V
Synonyms:
ITAV_HUMAN Integrin alpha-V/alpha-5 VNRA Vitronectin receptor | Vitronectin receptor subunit alpha
Type:
PROTEIN
Mol. Mass.:
116024.92
Organism:
Homo sapiens (Human)
Description:
ChEMBL_582336
Residue:
1048
  
Component 2
Name:
Integrin beta-3
Synonyms:
CD_antigen=CD61 GPIIIa ITGB3 Platelet membrane glycoprotein IIIa
Type:
Protein
Mol. Mass.:
87038.91
Organism:
Homo sapiens (Human)
Description:
P05106
Residue:
788
  
Inhibitor
Name:
BDBM50145527
Synonyms:
(S)-5-{4-[3-(5-Fluoro-1,4,5,6-tetrahydro-pyrimidin-2-ylamino)-phenyl]-piperazin-1-yl}-2-isobutoxycarbonylamino-5-oxo-pentanoic acid | CHEMBL87372
Type:
Small organic molecule
Emp. Form.:
C24H35FN6O5
Mol. Mass.:
506.5703
SMILES:
CC(C)COC(=O)N[C@@H](CCC(=O)N1CCN(CC1)c1cccc(NC2=NCC(F)CN2)c1)C(O)=O
: