Target
5-hydroxytryptamine receptor 1A
Ligand
BDBM50145598
Substrate
Meas. Tech.
ChEBML_922
Ki
1.4±n/a nM
Citation
 Rocco, VPSpinazze, PGKohn, TJHonigschmidt, NANelson, DLBradley Wainscott, DAhmad, LJShaw, JThrelkeld, PGWong, DTTakeuchi, K Advances toward new antidepressants beyond SSRIs: 1-aryloxy-3-piperidinylpropan-2-ols with dual 5-HT1A receptor antagonism/SSRI activities. Part 4. Bioorg Med Chem Lett 14:2653-6 (2004)  
Target
Name:
5-hydroxytryptamine receptor 1A
Synonyms:
5-HT-1A 5-hydroxytryptamine receptor 1A (5-HT-1A) ADRB2RL1 Dopamine D2 receptor and serotonin 1a receptor HTR1A | Serotonin receptor 1A
Type:
Mol. Mass.:
46122.49
Organism:
Homo sapiens (Human)
Description:
Residue:
422
  
Inhibitor
Name:
BDBM50145598
Synonyms:
(R)-1-((3S,4R)-4-Benzo[b]thiophen-5-yl-2-methyl-piperidin-1-yl)-3-(2-methyl-1H-indol-4-yloxy)-propan-2-ol | CHEMBL314163
Type:
Small organic molecule
Emp. Form.:
C26H30N2O2S
Mol. Mass.:
434.594
SMILES:
C[C@H]1C[C@@H](CCN1C[C@@H](O)COc1cccc2[nH]c(C)cc12)c1ccc2sccc2c1
: