Target
Sodium-dependent serotonin transporter
Ligand
BDBM50145598
Substrate
Meas. Tech.
ChEBML_271
Ki
0.300000±n/a nM
Citation
 Rocco, VPSpinazze, PGKohn, TJHonigschmidt, NANelson, DLBradley Wainscott, DAhmad, LJShaw, JThrelkeld, PGWong, DTTakeuchi, K Advances toward new antidepressants beyond SSRIs: 1-aryloxy-3-piperidinylpropan-2-ols with dual 5-HT1A receptor antagonism/SSRI activities. Part 4. Bioorg Med Chem Lett 14:2653-6 (2004)  
Target
Name:
Sodium-dependent serotonin transporter
Synonyms:
5-HT Transporter 5HTT SC6A4_HUMAN SLC6A4 Serotonin transporter (5HTT) Sodium-dependent serotonin transporter (SERT) | Solute carrier family 6 member 4
Type:
Multi-pass membrane protein
Mol. Mass.:
70322.51
Organism:
Homo sapiens (Human)
Description:
P31645
Residue:
630
  
Inhibitor
Name:
BDBM50145598
Synonyms:
(R)-1-((3S,4R)-4-Benzo[b]thiophen-5-yl-2-methyl-piperidin-1-yl)-3-(2-methyl-1H-indol-4-yloxy)-propan-2-ol | CHEMBL314163
Type:
Small organic molecule
Emp. Form.:
C26H30N2O2S
Mol. Mass.:
434.594
SMILES:
C[C@H]1C[C@@H](CCN1C[C@@H](O)COc1cccc2[nH]c(C)cc12)c1ccc2sccc2c1
: