Target
cGMP-inhibited 3',5'-cyclic phosphodiesterase 3A/3B
Ligand
BDBM14390
Substrate
Meas. Tech.
ChEMBL_156601 (CHEMBL759683)
IC50
7000±n/a nM
Citation
 Pitts, WJVaccaro, WHuynh, TLeftheris, KRoberge, JYBarbosa, JGuo, JBrown, BWatson, ADonaldson, KStarling, GCKiener, PAPoss, MADodd, JHBarrish, JC Identification of purine inhibitors of phosphodiesterase 7 (PDE7). Bioorg Med Chem Lett 14:2955-8 (2004)  
Target
Name:
cGMP-inhibited 3',5'-cyclic phosphodiesterase 3A/3B
Synonyms:
Phosphodiesterase (PDE3) Phosphodiesterase 3 (PDE3) | cGMP-inhibited 3',5'-cyclic phosphodiesterase A/B
Type:
Mol. Mass.:
Description:
ASSAY_ID of ChEMBL is 156458
Components:
This complex has 2 components.
Component 1
Name:
cGMP-inhibited 3',5'-cyclic phosphodiesterase 3B
Synonyms:
CGI-PDE B CGIPDE1 PDE3B Phosphodiesterase 3B Phosphodiesterase Type 3 (PDE3B) cGMP-inhibited 3,5-cyclic phosphodiesterase B
Type:
Enzyme
Mol. Mass.:
124318.95
Organism:
Homo sapiens (Human)
Description:
PDE3B was generated from the full-length recombinant human clone transfected into Sf9 cells.
Residue:
1112
  
Component 2
Name:
cGMP-inhibited 3',5'-cyclic phosphodiesterase 3A
Synonyms:
3',5'-cyclic phosphodiesterase Cyclic GMP-inhibited phosphodiesterase A PDE3A_HUMAN Phosphodiesterase 3 (PDE3) Phosphodiesterase 3A Phosphodiesterase 3A (PDE3A1) cGMP-inhibited 3',5'-cyclic phosphodiesterase A | cGMP-inhibited 3,5-cyclic phosphodiesterase A
Type:
Enzyme
Mol. Mass.:
124966.46
Organism:
Homo sapiens (Human)
Description:
Q14432
Residue:
1141
  
Inhibitor
Name:
BDBM14390
Synonyms:
5-[2-ethoxy-5-(4-methyl-1-piperazinylsulfonyl)phenyl]-1-methyl-3-n-propyl-1,6-dihydro-7H-pyrazolo[4,3-d]pyrimidin-7-one CHEMBL192 Sildenafil US11155558, Compound sildenafil Viagra
Type:
Small organic molecule
Emp. Form.:
C22H30N6O4S
Mol. Mass.:
474.576
SMILES:
CCCc1nn(C)c2c1nc([nH]c2=O)-c1cc(ccc1OCC)S(=O)(=O)N1CCN(C)CC1
: