Target
Adenosine receptor A1
Ligand
BDBM50059101
Substrate
Meas. Tech.
ChEMBL_29112 (CHEMBL638724)
Ki
5.3±n/a nM
Citation
 Ferrarini, PLBetti, LCavallini, TGiannaccini, GLucacchini, AManera, CMartinelli, AOrtore, GSaccomanni, GTuccinardi, T Study on affinity profile toward native human and bovine adenosine receptors of a series of 1,8-naphthyridine derivatives. J Med Chem 47:3019-31 (2004)  
Target
Name:
Adenosine receptor A1
Synonyms:
AA1R_BOVIN ADENOSINE A1 high ADORA1 | Adenosine A1 receptor
Type:
Enzyme Catalytic Domain
Mol. Mass.:
36602.99
Organism:
BOVINE
Description:
ADENOSINE 0 BOVINE::P28190
Residue:
326
  
Inhibitor
Name:
BDBM50059101
Synonyms:
2-(4-Fluoro-phenyl)-7-methyl-1H-[1,8]naphthyridin-4-one 2-(4-fluorophenyl)-7-methyl-1,8-naphthyridin-4-ol | CHEMBL313864
Type:
Small organic molecule
Emp. Form.:
C15H11FN2O
Mol. Mass.:
254.259
SMILES:
Cc1ccc2c(O)cc(nc2n1)-c1ccc(F)cc1
: