Target
Adenosine receptor A1
Ligand
BDBM50090700
Substrate
Meas. Tech.
ChEMBL_29102 (CHEMBL638714)
Ki
1.6±n/a nM
Citation
 Ferrarini, PLBetti, LCavallini, TGiannaccini, GLucacchini, AManera, CMartinelli, AOrtore, GSaccomanni, GTuccinardi, T Study on affinity profile toward native human and bovine adenosine receptors of a series of 1,8-naphthyridine derivatives. J Med Chem 47:3019-31 (2004)  
Target
Name:
Adenosine receptor A1
Synonyms:
AA1R_BOVIN ADENOSINE A1 high ADORA1 | Adenosine A1 receptor
Type:
Enzyme Catalytic Domain
Mol. Mass.:
36602.99
Organism:
BOVINE
Description:
ADENOSINE 0 BOVINE::P28190
Residue:
326
  
Inhibitor
Name:
BDBM50090700
Synonyms:
7-Bromo-2-phenyl-[1,8]naphthyridin-4-ol CHEMBL97687
Type:
Small organic molecule
Emp. Form.:
C14H9BrN2O
Mol. Mass.:
301.138
SMILES:
Oc1cc(nc2nc(Br)ccc12)-c1ccccc1
: