Target
Sodium-dependent serotonin transporter
Ligand
BDBM50148373
Substrate
Meas. Tech.
ChEMBL_201361 (CHEMBL804696)
Ki
120±n/a nM
Citation
 Kuo, FGillespie, TAKulanthaivel, PLantz, RJMa, TWNelson, DLThrelkeld, PGWheeler, WJYi, PZmijewski, M Synthesis and biological activity of some known and putative duloxetine metabolites. Bioorg Med Chem Lett 14:3481-6 (2004)  
Target
Name:
Sodium-dependent serotonin transporter
Synonyms:
5-HT Transporter 5HTT SC6A4_HUMAN SLC6A4 Serotonin transporter (5HTT) Sodium-dependent serotonin transporter (SERT) | Solute carrier family 6 member 4
Type:
Multi-pass membrane protein
Mol. Mass.:
70322.51
Organism:
Homo sapiens (Human)
Description:
P31645
Residue:
630
  
Inhibitor
Name:
BDBM50148373
Synonyms:
5-((S)-3-Methylamino-1-thiophen-2-yl-propoxy)-naphthalene-1,2-diol | CHEMBL326713
Type:
Small organic molecule
Emp. Form.:
C18H19NO3S
Mol. Mass.:
329.413
SMILES:
CNCC[C@H](Oc1cccc2c(O)c(O)ccc12)c1cccs1
: