Target
Sodium-dependent dopamine transporter
Ligand
BDBM50148379
Substrate
Meas. Tech.
ChEBML_61522
Ki
130±n/a nM
Citation
 Kuo, FGillespie, TAKulanthaivel, PLantz, RJMa, TWNelson, DLThrelkeld, PGWheeler, WJYi, PZmijewski, M Synthesis and biological activity of some known and putative duloxetine metabolites. Bioorg Med Chem Lett 14:3481-6 (2004)  
Target
Name:
Sodium-dependent dopamine transporter
Synonyms:
DA transporter DAT1 Dopamine transporter protein (DAT) SC6A3_HUMAN Sodium-dependent dopamine transporter Solute carrier family 6 member 3
Type:
Multi-pass membrane protein
Mol. Mass.:
68497.11
Organism:
Homo sapiens (Human)
Description:
Q01959
Residue:
620
  
Inhibitor
Name:
BDBM50148379
Synonyms:
4-((S)-3-Methylamino-1-thiophen-2-yl-propoxy)-naphthalen-1-ol | CHEMBL332097
Type:
Small organic molecule
Emp. Form.:
C18H19NO2S
Mol. Mass.:
313.414
SMILES:
CNCC[C@H](Oc1ccc(O)c2ccccc12)c1cccs1
: