Target
Beta-3 adrenergic receptor
Ligand
BDBM50148483
Substrate
Meas. Tech.
ChEBML_39051
Ki
370±n/a nM
Target
Name:
Beta-3 adrenergic receptor
Synonyms:
ADRB3 ADRB3_HUMAN Beta-2 adrenergic receptor and beta-3 adrenergic receptor Beta-3 adrenoreceptor | adrenergic Beta3
Type:
G Protein-Coupled Receptor (GPCR)
Mol. Mass.:
43534.88
Organism:
Homo sapiens (Human)
Description:
Residue:
408
  
Inhibitor
Name:
BDBM50148483
Synonyms:
(S)-2-[2-Hydroxy-2-((R)-4-hydroxy-3-methanesulfonylamino-phenyl)-ethylamino]-2-(4-methoxy-phenyl)-N-(3,4,5-trimethoxy-phenyl)-propionamide | CHEMBL118834
Type:
Small organic molecule
Emp. Form.:
C28H35N3O9S
Mol. Mass.:
589.657
SMILES:
COc1ccc(cc1)[C@](C)(NC[C@H](O)c1ccc(O)c(NS(C)(=O)=O)c1)C(=O)Nc1cc(OC)c(OC)c(OC)c1
: