Target
Corticotropin-releasing factor receptor 1
Ligand
BDBM50148903
Substrate
Meas. Tech.
ChEBML_51104
Ki
1.3±n/a nM
Citation
 Chen, CWilcoxen, KMHuang, CQMcCarthy, JRChen, TGrigoriadis, DE Optimization of 3-phenylpyrazolo[1,5-a]pyrimidines as potent corticotropin-releasing factor-1 antagonists with adequate lipophilicity and water solubility. Bioorg Med Chem Lett 14:3669-73 (2004)  
Target
Name:
Corticotropin-releasing factor receptor 1
Synonyms:
CRF-R CRF1 CRFR1 CRH-R 1 CRHR1 Corticotropin-releasing factor receptor 1 (CRF-1) Corticotropin-releasing hormone receptor 1
Type:
Enzyme
Mol. Mass.:
50744.31
Organism:
Homo sapiens (Human)
Description:
P34998
Residue:
444
  
Inhibitor
Name:
BDBM50148903
Synonyms:
CHEMBL413756 | [3-(3,4-Dimethoxy-phenyl)-2,5-dimethyl-3H-pyrazolo[1,5-a]pyrimidin-7-yl]-dipropyl-amine
Type:
Small organic molecule
Emp. Form.:
C22H30N4O2
Mol. Mass.:
382.4992
SMILES:
CCCN(CCC)c1cc(C)nc2c(c(C)nn12)-c1ccc(OC)c(OC)c1
: