Target
Estrogen receptor
Ligand
BDBM50149485
Substrate
Meas. Tech.
ChEMBL_304574 (CHEMBL831071)
IC50
1±n/a nM
Citation
 Blizzard, TADiNinno, FMorgan, JDChen, HYWu, JYGude, CKim, SChan, WBirzin, ETTien Yang, YPai, LYZhang, ZHayes, ECDaSilva, CATang, WRohrer, SPSchaeffer, JMHammond, ML Estrogen receptor ligands. Part 7: Dihydrobenzoxathiin SERAMs with bicyclic amine side chains. Bioorg Med Chem Lett 14:3861-4 (2004)  
Target
Name:
Estrogen receptor
Synonyms:
ER ESR ESR1_HUMAN Estrogen receptor Estrogen receptor (ER-alpha) Estrogen receptor alpha (ER) Nuclear receptor subfamily 3 group A member 1
Type:
Protein
Mol. Mass.:
66230.44
Organism:
Homo sapiens (Human)
Description:
P03372
Residue:
595
  
Inhibitor
Name:
BDBM50149485
Synonyms:
(2S,3R)-3-(4-Hydroxy-phenyl)-2-{4-[(6R,7S)-2-(octahydro-isoindol-2-yl)-ethoxy]-phenyl}-2,3-dihydro-benzo[1,4]oxathiin-6-ol | CHEMBL185231
Type:
Small organic molecule
Emp. Form.:
C30H33NO4S
Mol. Mass.:
503.652
SMILES:
Oc1ccc(cc1)[C@H]1Sc2cc(O)ccc2O[C@H]1c1ccc(OCCN2C[C@H]3CCCC[C@H]3C2)cc1
: