Target
Sodium- and chloride-dependent glycine transporter 1
Ligand
BDBM50149856
Substrate
Meas. Tech.
ChEMBL_305548 (CHEMBL828567)
IC50
320±n/a nM
Citation
 Smith, GRuhland, TMikkelsen, GAndersen, KChristoffersen, CTAlifrangis, LHMørk, AWren, SPHarris, NWyman, BMBrandt, G The synthesis and SAR of 2-arylsulfanyl-phenyl piperazinyl acetic acids as glyT-1 inhibitors. Bioorg Med Chem Lett 14:4027-30 (2004)  
Target
Name:
Sodium- and chloride-dependent glycine transporter 1
Synonyms:
GlyT-1 Glycine Transporters (GlyT1c) SC6A9_HUMAN Sodium- and chloride-dependent glycine transporter 1 Sodium- and chloride-dependent glycine transporter 1 (GlyT1c) Solute carrier family 6 member 9
Type:
Enzyme
Mol. Mass.:
78270.54
Organism:
Homo sapiens (Human)
Description:
P48067
Residue:
706
  
Inhibitor
Name:
BDBM50149856
Synonyms:
CHEMBL360052 | {Methyl-[(R)-3-phenyl-3-(4-trifluoromethyl-phenoxy)-propyl]-amino}-acetic acid
Type:
Small organic molecule
Emp. Form.:
C19H20F3NO3
Mol. Mass.:
367.3622
SMILES:
CN(CC[C@@H](Oc1ccc(cc1)C(F)(F)F)c1ccccc1)CC(O)=O
: