Target
5-hydroxytryptamine receptor 1A
Ligand
BDBM86708
Substrate
Meas. Tech.
ChEMBL_614 (CHEMBL615164)
EC50
7.1±n/a nM
Citation
 Mewshaw, REZhou, DZhou, PShi, XHornby, GSpangler, TScerni, RSmith, DSchechter, LEAndree, TH Studies toward the discovery of the next generation of antidepressants. 3. Dual 5-HT1A and serotonin transporter affinity within a class of N-aryloxyethylindolylalkylamines. J Med Chem 47:3823-42 (2004)  
Target
Name:
5-hydroxytryptamine receptor 1A
Synonyms:
5-HT-1A 5-hydroxytryptamine receptor 1A (5-HT-1A) ADRB2RL1 Dopamine D2 receptor and serotonin 1a receptor HTR1A | Serotonin receptor 1A
Type:
Mol. Mass.:
46122.49
Organism:
Homo sapiens (Human)
Description:
Residue:
422
  
Inhibitor
Name:
BDBM86708
Synonyms:
CAS_146714-97-8 CHEMBL514874 NSC_104911 | WAY 100,635
Type:
Small organic molecule
Emp. Form.:
C25H34N4O2
Mol. Mass.:
422.5631
SMILES:
COc1ccccc1N1CCN(CCN(C(=O)C2CCCCC2)c2ccccn2)CC1
: