Target
5-hydroxytryptamine receptor 1A
Ligand
BDBM50150101
Substrate
Meas. Tech.
ChEMBL_614 (CHEMBL615164)
EC50
1.1±n/a nM
Citation
 Mewshaw, REZhou, DZhou, PShi, XHornby, GSpangler, TScerni, RSmith, DSchechter, LEAndree, TH Studies toward the discovery of the next generation of antidepressants. 3. Dual 5-HT1A and serotonin transporter affinity within a class of N-aryloxyethylindolylalkylamines. J Med Chem 47:3823-42 (2004)  
Target
Name:
5-hydroxytryptamine receptor 1A
Synonyms:
5-HT-1A 5-hydroxytryptamine receptor 1A (5-HT-1A) ADRB2RL1 Dopamine D2 receptor and serotonin 1a receptor HTR1A | Serotonin receptor 1A
Type:
Mol. Mass.:
46122.49
Organism:
Homo sapiens (Human)
Description:
Residue:
422
  
Inhibitor
Name:
BDBM50150101
Synonyms:
CHEMBL419240 | [2-(2,3-Dihydro-benzo[1,4]dioxin-5-yloxy)-ethyl]-[3-(5-fluoro-1H-indol-3-yl)-propyl]-amine
Type:
Small organic molecule
Emp. Form.:
C21H23FN2O3
Mol. Mass.:
370.4173
SMILES:
Fc1ccc2[nH]cc(CCCNCCOc3cccc4OCCOc34)c2c1
: