Target
Phenylethanolamine N-methyltransferase
Ligand
BDBM14061
Substrate
Meas. Tech.
ChEMBL_303166 (CHEMBL829978)
Ki
10±n/a nM
Citation
 Wu, QCriscione, KRGrunewald, GLMcLeish, MJ Phenylethanolamine N-methyltransferase inhibition: re-evaluation of kinetic data. Bioorg Med Chem Lett 14:4217-20 (2004)  
Target
Name:
Phenylethanolamine N-methyltransferase
Synonyms:
Noradrenaline N-methyltransferase PNMT PNMTase | Phenylethanolamine N-Methyltransferase (PNMT)
Type:
Enzyme
Mol. Mass.:
30852.66
Organism:
Homo sapiens (Human)
Description:
Residue:
282
  
Inhibitor
Name:
BDBM14061
Synonyms:
8,9-Dichloro-2,3,4,5-tetrahydro-1H-2-benzazepine LY134046 | tetrahydrobenzazepine (THBA) deriv.
Type:
Small organic molecule
Emp. Form.:
C10H11Cl2N
Mol. Mass.:
216.107
SMILES:
Clc1ccc2CCCNCc2c1Cl
: