Target
Poly [ADP-ribose] polymerase 1
Ligand
BDBM27506
Substrate
Meas. Tech.
ChEMBL_306013 (CHEMBL833529)
IC50
11200±n/a nM
Citation
 Hattori, KKido, YYamamoto, HIshida, JKamijo, KMurano, KOhkubo, MKinoshita, TIwashita, AMihara, KYamazaki, SMatsuoka, NTeramura, YMiyake, H Rational approaches to discovery of orally active and brain-penetrable quinazolinone inhibitors of poly(ADP-ribose)polymerase. J Med Chem 47:4151-4 (2004)  
Target
Name:
Poly [ADP-ribose] polymerase 1
Synonyms:
(ARTD1 or PARP1) 2.4.2.30 ADPRT ARTD1 Human diphtheria toxin-like ADP-ribosyltransferase (ARTD1 or PARP1) NT-PARP-1 PARP1 PPOL Poly [ADP-ribose] polymerase 1 (PARP) Poly [ADP-ribose] polymerase 1 (PARP1) Poly [ADP-ribose] polymerase 1, 28-kDa form Poly [ADP-ribose] polymerase 1, processed C-terminus Poly [ADP-ribose] polymerase-1 Poly(ADP-ribose) polymerase-1 (ARTD1/PARP1) Protein poly-ADP-ribosyltransferase PARP1 | Synonyms=ADPRT
Type:
Mol. Mass.:
113114.22
Organism:
Homo sapiens (Human)
Description:
P09874
Residue:
1014
  
Inhibitor
Name:
BDBM27506
Synonyms:
3-AB CHEMBL81977
Type:
Small organic molecule
Emp. Form.:
C7H8N2O
Mol. Mass.:
136.1512
SMILES:
NC(=O)c1cccc(N)c1
: