Target
Bifunctional dihydrofolate reductase-thymidylate synthase
Ligand
BDBM50110768
Substrate
Meas. Tech.
ChEMBL_302861 (CHEMBL828776)
Ki
9.60±n/a nM
Citation
 Parenti, MDPacchioni, SFerrari, AMRastelli, G Three-dimensional quantitative structure-activity relationship analysis of a set of Plasmodium falciparum dihydrofolate reductase inhibitors using a pharmacophore generation approach. J Med Chem 47:4258-67 (2004)  
Target
Name:
Bifunctional dihydrofolate reductase-thymidylate synthase
Synonyms:
DHFR-TS Dihydrofolate Reductase-Thymidylate Synthase (DHFR-TS) Mutant KICB1 PfDHFR-TS double mutant (C59R+S108N)
Type:
Enzyme
Mol. Mass.:
71822.51
Organism:
Plasmodium falciparum (isolate K1 / Thailand)
Description:
The mutant clone was prepared by cassette mutagenesis using wildtype pfDHFR as a template, and expressed in E. coli.
Residue:
608
  
Inhibitor
Name:
BDBM50110768
Synonyms:
5-[4-(2,4-Dichloro-benzyloxy)-3-methoxy-phenyl]-6-ethyl-pyrimidine-2,4-diamine | CHEMBL22129
Type:
Small organic molecule
Emp. Form.:
C20H20Cl2N4O2
Mol. Mass.:
419.304
SMILES:
CCc1nc(N)nc(N)c1-c1ccc(OCc2ccc(Cl)cc2Cl)c(OC)c1
: