Target
Sensory histidine kinase DcuS
Ligand
BDBM50151876
Substrate
Meas. Tech.
ChEMBL_305976 (CHEMBL832141)
IC50
86±n/a nM
Citation
 Chan, WCCoyle, BJWilliams, P Virulence regulation and quorum sensing in staphylococcal infections: competitive AgrC antagonists as quorum sensing inhibitors. J Med Chem 47:4633-41 (2004)  
Target
Name:
Sensory histidine kinase DcuS
Synonyms:
Receptor-histidine kinase AgrC
Type:
PROTEIN
Mol. Mass.:
49890.25
Organism:
Staphylococcus aureus
Description:
ChEMBL_305973
Residue:
430
  
Inhibitor
Name:
BDBM50151876
Synonyms:
CHEMBL182783 | GVNACSSLF
Type:
Small organic molecule
Emp. Form.:
C38H60N10O13S
Mol. Mass.:
897.007
SMILES:
CC(C)C[C@H](NC(=O)[C@H](CO)NC(=O)[C@H](CO)NC(=O)[C@H](CS)NC(=O)[C@H](C)NC(=O)[C@H](CC(N)=O)NC(=O)[C@@H](NC(=O)CN)C(C)C)C(=O)N[C@@H](Cc1ccccc1)C(O)=O
: