Target
Sensory histidine kinase DcuS
Ligand
BDBM50151883
Substrate
Meas. Tech.
ChEMBL_305474 (CHEMBL831083)
IC50
295.0±n/a nM
Citation
 Chan, WCCoyle, BJWilliams, P Virulence regulation and quorum sensing in staphylococcal infections: competitive AgrC antagonists as quorum sensing inhibitors. J Med Chem 47:4633-41 (2004)  
Target
Name:
Sensory histidine kinase DcuS
Synonyms:
Receptor-histidine kinase AgrC
Type:
PROTEIN
Mol. Mass.:
49890.25
Organism:
Staphylococcus aureus
Description:
ChEMBL_305973
Residue:
430
  
Inhibitor
Name:
BDBM50151883
Synonyms:
CHEMBL276191 | N-[9-Benzyl-6-sec-butyl-12-methyl-3-(2-methylsulfanyl-ethyl)-2,5,8,11,14-pentaoxo-1-thia-4,7,10,13-tetraaza-cyclohexadec-15-yl]-2-{2-[4-(4-benzyl-phenoxy)-butyrylamino]-3-hydroxy-propionylamino}-3-hydroxy-butyramide
Type:
Small organic molecule
Emp. Form.:
C50H67N7O11S2
Mol. Mass.:
1006.237
SMILES:
CC[C@H](C)[C@H]1NC(=O)[C@H](Cc2ccccc2)NC(=O)[C@@H](C)NC(=O)[C@@H](CSC(=O)[C@H](CCSC)NC1=O)NC(=O)[C@@H](NC(=O)[C@H](CO)NC(=O)CCCOc1ccc(Cc2ccccc2)cc1)[C@@H](C)O
: