Target
5-hydroxytryptamine receptor 1A
Ligand
BDBM50152011
Substrate
Meas. Tech.
ChEBML_306315
IC50
0.400000±n/a nM
Citation
 Heinrich, TBöttcher, HGericke, RBartoszyk, GDAnzali, SSeyfried, CAGreiner, HEVan Amsterdam, C Synthesis and structure--activity relationship in a class of indolebutylpiperazines as dual 5-HT(1A) receptor agonists and serotonin reuptake inhibitors. J Med Chem 47:4684-92 (2004)  
Target
Name:
5-hydroxytryptamine receptor 1A
Synonyms:
5-HT-1A 5-HT1A 5-hydroxytryptamine receptor 1A (5HT1A) 5ht1a Htr1a Serotonin 1a (5-HT1a) receptor/Adrenergic receptor alpha-1 | Serotonin receptor 1A
Type:
G Protein-Coupled Receptor (GPCR)
Mol. Mass.:
46445.29
Organism:
Rattus norvegicus (rat)
Description:
Binding assays were performed using rat hippocampal membranes.
Residue:
422
  
Inhibitor
Name:
BDBM50152011
Synonyms:
3-{4-[4-(2-Cyano-benzofuran-5-yl)-piperazin-1-yl]-butyl}-1H-indole-5-carbonitrile | CHEMBL184556
Type:
Small organic molecule
Emp. Form.:
C26H25N5O
Mol. Mass.:
423.5096
SMILES:
N#Cc1cc2cc(ccc2o1)N1CCN(CCCCc2c[nH]c3ccc(cc23)C#N)CC1
: