Target
Melanocortin receptor 3
Ligand
BDBM50152280
Substrate
Meas. Tech.
ChEMBL_310168 (CHEMBL824824)
EC50
452±n/a nM
Citation
 Koikov, LNEbetino, FHHayes, JCCross-Doersen, DKnittel, JJ End-capping of the modified melanocortin tetrapeptide (p-Cl)Phe-D-Phe-Arg-Trp-NH2 as a route to hMC4R agonists. Bioorg Med Chem Lett 14:4839-42 (2004)  
Target
Name:
Melanocortin receptor 3
Synonyms:
MC3-R MC3R_HUMAN Melanocortin receptor (M3 and M4)
Type:
Enzyme
Mol. Mass.:
36044.86
Organism:
Homo sapiens (Human)
Description:
P41968
Residue:
323
  
Inhibitor
Name:
BDBM50152280
Synonyms:
CHEMBL364119 | Pyridine-2-carboxylic acid [(S)-1-((S)-1-{(S)-1-[(S)-1-carbamoyl-2-(1H-indol-3-yl)-ethylcarbamoyl]-4-guanidino-butylcarbamoyl}-2-phenyl-ethylcarbamoyl)-2-(4-chloro-phenyl)-ethyl]-amide
Type:
Small organic molecule
Emp. Form.:
C41H45ClN10O5
Mol. Mass.:
793.313
SMILES:
NC(=N)NCCC[C@H](NC(=O)[C@H](Cc1ccccc1)NC(=O)[C@H](Cc1ccc(Cl)cc1)NC(=O)c1ccccn1)C(=O)N[C@@H](Cc1c[nH]c2ccccc12)C(N)=O
: