Target
Melanocortin receptor 3
Ligand
BDBM50152258
Substrate
Meas. Tech.
ChEMBL_310168 (CHEMBL824824)
EC50
3044±n/a nM
Citation
 Koikov, LNEbetino, FHHayes, JCCross-Doersen, DKnittel, JJ End-capping of the modified melanocortin tetrapeptide (p-Cl)Phe-D-Phe-Arg-Trp-NH2 as a route to hMC4R agonists. Bioorg Med Chem Lett 14:4839-42 (2004)  
Target
Name:
Melanocortin receptor 3
Synonyms:
MC3-R MC3R_HUMAN Melanocortin receptor (M3 and M4)
Type:
Enzyme
Mol. Mass.:
36044.86
Organism:
Homo sapiens (Human)
Description:
P41968
Residue:
323
  
Inhibitor
Name:
BDBM50152258
Synonyms:
(S)-2-{(S)-2-[(S)-3-(4-Chloro-phenyl)-2-(2-cyano-acetylamino)-propionylamino]-3-phenyl-propionylamino}-5-guanidino-pentanoic acid [(S)-1-carbamoyl-2-(1H-indol-3-yl)-ethyl]-amide | CHEMBL186687
Type:
Small organic molecule
Emp. Form.:
C38H43ClN10O5
Mol. Mass.:
755.265
SMILES:
NC(=N)NCCC[C@H](NC(=O)[C@H](Cc1ccccc1)NC(=O)[C@H](Cc1ccc(Cl)cc1)NC(=O)CC#N)C(=O)N[C@@H](Cc1c[nH]c2ccccc12)C(N)=O
: