Target
Melanocortin receptor 3
Ligand
BDBM50152247
Substrate
Meas. Tech.
ChEMBL_310168 (CHEMBL824824)
EC50
93±n/a nM
Citation
 Koikov, LNEbetino, FHHayes, JCCross-Doersen, DKnittel, JJ End-capping of the modified melanocortin tetrapeptide (p-Cl)Phe-D-Phe-Arg-Trp-NH2 as a route to hMC4R agonists. Bioorg Med Chem Lett 14:4839-42 (2004)  
Target
Name:
Melanocortin receptor 3
Synonyms:
MC3-R MC3R_HUMAN Melanocortin receptor (M3 and M4)
Type:
Enzyme
Mol. Mass.:
36044.86
Organism:
Homo sapiens (Human)
Description:
P41968
Residue:
323
  
Inhibitor
Name:
BDBM50152247
Synonyms:
2-{(S)-2-[(S)-3-(4-Chloro-phenyl)-1-oxo-2-(3-phenyl-ureido)-propylamino]-3-phenyl-propionylamino}-5-guanidino-pentanoic acid [(S)-1-carbamoyl-2-(1H-indol-3-yl)-ethyl]-amide | CHEMBL359765
Type:
Small organic molecule
Emp. Form.:
C42H47ClN10O5
Mol. Mass.:
807.34
SMILES:
NC(=N)NCCC[C@H](NC(=O)[C@H](Cc1ccccc1)NC(=O)[C@H](Cc1ccc(Cl)cc1)NC(=O)Nc1ccccc1)C(=O)N[C@@H](Cc1c[nH]c2ccccc12)C(N)=O
: