Target
Melanin-concentrating hormone receptor 1
Ligand
BDBM50150715
Substrate
Meas. Tech.
ChEMBL_306737 (CHEMBL832324)
IC50
85±n/a nM
Citation
 Vasudevan, AWodka, DVerzal, MKSouers, AJGao, JBrodjian, SFry, DDayton, BMarsh, KCHernandez, LEOgiela, CACollins, CAKym, PR Synthesis and evaluation of 2-amino-8-alkoxy quinolines as MCHr1 antagonists. Part 2. Bioorg Med Chem Lett 14:4879-82 (2004)  
Target
Name:
Melanin-concentrating hormone receptor 1
Synonyms:
G-protein coupled receptor 24 MCH receptor 1 MCH-R1 MCHR-1 MCHR1_HUMAN Melanin-Concentrating Hormone Receptor 1 (MCH1R) Melanin-concentrating hormone receptor 1 (MCH-1) Melanin-concentrating hormone receptor 1 (MCHR-1) SLC-1 Somatostatin receptor-like protein
Type:
G Protein-Coupled Receptor (GPCR)
Mol. Mass.:
45976.27
Organism:
Homo sapiens (Human)
Description:
Membranes from CHO-K1 cells stably expressing human MCH1R were used in assays.
Residue:
422
  
Inhibitor
Name:
BDBM50150715
Synonyms:
4''-Fluoro-biphenyl-4-carboxylic acid (6-dimethylaminomethyl-5,6,7,8-tetrahydro-naphthalen-2-yl)-amide CHEMBL178707 T-226296
Type:
Small organic molecule
Emp. Form.:
C26H27FN2O
Mol. Mass.:
402.5038
SMILES:
CN(C)CC1CCc2cc(NC(=O)c3ccc(cc3)-c3ccc(F)cc3)ccc2C1
: