Target
Fatty acid-binding protein, heart
Ligand
BDBM50152850
Substrate
Meas. Tech.
ChEMBL_306095 (CHEMBL830870)
IC50
2600±n/a nM
Citation
 Lehmann, FHaile, SAxen, EMedina, CUppenberg, JSvensson, SLundbäck, TRondahl, LBarf, T Discovery of inhibitors of human adipocyte fatty acid-binding protein, a potential type 2 diabetes target. Bioorg Med Chem Lett 14:4445-8 (2004)  
Target
Name:
Fatty acid-binding protein, heart
Synonyms:
FABP11 FABPH_HUMAN MDGI
Type:
PROTEIN
Mol. Mass.:
14858.36
Organism:
Homo sapiens (Human)
Description:
ChEMBL_1463784
Residue:
133
  
Inhibitor
Name:
BDBM50152850
Synonyms:
1-HEXYLDECANOIC ACID Hexadecanoic acid Palmitic acid (PA)
Type:
Small organic molecule
Emp. Form.:
C16H32O2
Mol. Mass.:
256.4241
SMILES:
CCCCCCCCCCCCCCCC(O)=O
: