Target
Integrin alpha-V/beta-3
Ligand
BDBM50153553
Substrate
Meas. Tech.
ChEMBL_305375 (CHEMBL832890)
IC50
1.1±n/a nM
Citation
 De Corte, BLKinney, WALiu, LGhosh, SBrunner, LHoekstra, WJSantulli, RJTuman, RWBaker, JBurns, CProost, JCTounge, BADamiano, BPMaryanoff, BEJohnson, DLGalemmo, RA Piperidine-containing beta-arylpropionic acids as potent antagonists of alphavbeta3/alphavbeta5 integrins. Bioorg Med Chem Lett 14:5227-32 (2004)  
Target
Name:
Integrin alpha-V/beta-3
Synonyms:
ITGAV/ITGB3 | Integrin beta-3/Vitronectin receptor alpha
Type:
Enzyme
Mol. Mass.:
Description:
Components:
This complex has 2 components.
Component 1
Name:
Integrin alpha-V
Synonyms:
ITAV_HUMAN Integrin alpha-V/alpha-5 VNRA Vitronectin receptor | Vitronectin receptor subunit alpha
Type:
PROTEIN
Mol. Mass.:
116024.92
Organism:
Homo sapiens (Human)
Description:
ChEMBL_582336
Residue:
1048
  
Component 2
Name:
Integrin beta-3
Synonyms:
CD_antigen=CD61 GPIIIa ITGB3 Platelet membrane glycoprotein IIIa
Type:
Protein
Mol. Mass.:
87038.91
Organism:
Homo sapiens (Human)
Description:
P05106
Residue:
788
  
Inhibitor
Name:
BDBM50153553
Synonyms:
3-Benzo[1,3]dioxol-5-yl-4-[1-(3-5,6,7,8-tetrahydro-[1,8]naphthyridin-2-yl-propionyl)-piperidin-4-yl]-butyric acid | CHEMBL364562
Type:
Small organic molecule
Emp. Form.:
C27H33N3O5
Mol. Mass.:
479.568
SMILES:
OC(=O)CC(CC1CCN(CC1)C(=O)CCc1ccc2CCCNc2n1)c1ccc2OCOc2c1
: