Target
Sodium-dependent serotonin transporter
Ligand
BDBM50153625
Substrate
Meas. Tech.
ChEMBL_302824 (CHEMBL839613)
Ki
0.54±n/a nM
Citation
 Gilbert, AMColeman, TKodah, JMewshaw, REScerni, RSchechter, LESmith, DLAndree, TH Novel aryloxy-8-azabicyclo[3.2.1]oct-3-enes with 5-HT transporter and 5-HT1A affinity. Bioorg Med Chem Lett 14:5281-4 (2004)  
Target
Name:
Sodium-dependent serotonin transporter
Synonyms:
5-HT Transporter 5HT transporter Anandamid membrane transporter, AMT Monoamine transporters; Norepinephrine & serotonin Slc6a4 Sodium-dependent serotonin transporter (SERT) | imipramine receptor
Type:
Multi-pass membrane protein
Mol. Mass.:
70168.43
Organism:
Rattus norvegicus (rat)
Description:
P31652
Residue:
630
  
Inhibitor
Name:
BDBM50153625
Synonyms:
(S)-1-(1H-Indol-4-yloxy)-3-(3-naphthalen-2-yl-8-aza-bicyclo[3.2.1]oct-2-en-8-yl)-propan-2-ol | CHEMBL186202
Type:
Small organic molecule
Emp. Form.:
C28H28N2O2
Mol. Mass.:
424.5341
SMILES:
O[C@H](COc1cccc2[nH]ccc12)CN1C2CCC1C=C(C2)c1ccc2ccccc2c1
: