Target
Sodium-dependent serotonin transporter
Ligand
BDBM50153633
Substrate
Meas. Tech.
ChEMBL_302824 (CHEMBL839613)
Ki
0.65±n/a nM
Citation
 Gilbert, AMColeman, TKodah, JMewshaw, REScerni, RSchechter, LESmith, DLAndree, TH Novel aryloxy-8-azabicyclo[3.2.1]oct-3-enes with 5-HT transporter and 5-HT1A affinity. Bioorg Med Chem Lett 14:5281-4 (2004)  
Target
Name:
Sodium-dependent serotonin transporter
Synonyms:
5-HT Transporter 5HT transporter Anandamid membrane transporter, AMT Monoamine transporters; Norepinephrine & serotonin Slc6a4 Sodium-dependent serotonin transporter (SERT) | imipramine receptor
Type:
Multi-pass membrane protein
Mol. Mass.:
70168.43
Organism:
Rattus norvegicus (rat)
Description:
P31652
Residue:
630
  
Inhibitor
Name:
BDBM50153633
Synonyms:
4-{3-[3-(3,4-Dichloro-phenyl)-8-aza-bicyclo[3.2.1]oct-2-en-8-yl]-propoxy}-1H-indole | CHEMBL406134
Type:
Small organic molecule
Emp. Form.:
C24H24Cl2N2O
Mol. Mass.:
427.366
SMILES:
Clc1ccc(cc1Cl)C1=CC2CCC(C1)N2CCCOc1cccc2[nH]ccc12
: