Target
Mitogen-activated protein kinase 14
Ligand
BDBM50153829
Substrate
Meas. Tech.
ChEMBL_305841 (CHEMBL829582)
IC50
30±n/a nM
Citation
 Brown, DSBelfield, AJBrown, GRCampbell, DFoubister, AMasters, DJPike, KGSnelson, WLWells, SL A novel series of p38 MAP kinase inhibitors for the potential treatment of rheumatoid arthritis. Bioorg Med Chem Lett 14:5383-7 (2004)  
Target
Name:
Mitogen-activated protein kinase 14
Synonyms:
CSAID-binding protein CSBP1 CSPB1 MAP kinase 14 MAP kinase p38 alpha MAPK14 MK14_HUMAN Mitogen-activated protein kinase p38 alpha Stress-activated protein kinase 2a | p38 MAP kinase alpha/beta
Type:
Serine/threonine-protein kinase
Mol. Mass.:
41286.76
Organism:
Homo sapiens (Human)
Description:
Q16539
Residue:
360
  
Inhibitor
Name:
BDBM50153829
Synonyms:
4-methyl-1-[3-(1,4-oxazinan-4-yl)phenylcarboxamido]-3-[4-(2-pyridylmethoxy)phenylcarboxamido]benzene | CHEMBL184721
Type:
Small organic molecule
Emp. Form.:
C31H30N4O4
Mol. Mass.:
522.5943
SMILES:
Cc1ccc(NC(=O)c2cccc(c2)N2CCOCC2)cc1NC(=O)c1ccc(OCc2ccccn2)cc1
: