Target
Mitogen-activated protein kinase 14
Ligand
BDBM50153853
Substrate
Meas. Tech.
ChEMBL_305835 (CHEMBL874544)
IC50
50±n/a nM
Citation
 Cumming, JGMcKenzie, CLBowden, SGCampbell, DMasters, DJBreed, JJewsbury, PJ Novel, potent and selective anilinoquinazoline and anilinopyrimidine inhibitors of p38 MAP kinase. Bioorg Med Chem Lett 14:5389-94 (2004)  
Target
Name:
Mitogen-activated protein kinase 14
Synonyms:
CSAID-binding protein CSBP1 CSPB1 MAP kinase 14 MAP kinase p38 alpha MAPK14 MK14_HUMAN Mitogen-activated protein kinase p38 alpha Stress-activated protein kinase 2a | p38 MAP kinase alpha/beta
Type:
Serine/threonine-protein kinase
Mol. Mass.:
41286.76
Organism:
Homo sapiens (Human)
Description:
Q16539
Residue:
360
  
Inhibitor
Name:
BDBM50153853
Synonyms:
CHEMBL188167 | N-{3-[7-Methoxy-6-(2-piperidin-1-yl-ethoxy)-quinazolin-4-ylamino]-4-methyl-phenyl}-2-morpholin-4-yl-isonicotinamide
Type:
Small organic molecule
Emp. Form.:
C33H39N7O4
Mol. Mass.:
597.7073
SMILES:
COc1cc2ncnc(Nc3cc(NC(=O)c4ccnc(c4)N4CCOCC4)ccc3C)c2cc1OCCN1CCCCC1
: