Target
Mitogen-activated protein kinase 14
Ligand
BDBM50153861
Substrate
Meas. Tech.
ChEMBL_305835 (CHEMBL874544)
IC50
10±n/a nM
Citation
 Cumming, JGMcKenzie, CLBowden, SGCampbell, DMasters, DJBreed, JJewsbury, PJ Novel, potent and selective anilinoquinazoline and anilinopyrimidine inhibitors of p38 MAP kinase. Bioorg Med Chem Lett 14:5389-94 (2004)  
Target
Name:
Mitogen-activated protein kinase 14
Synonyms:
CSAID-binding protein CSBP1 CSPB1 MAP kinase 14 MAP kinase p38 alpha MAPK14 MK14_HUMAN Mitogen-activated protein kinase p38 alpha Stress-activated protein kinase 2a | p38 MAP kinase alpha/beta
Type:
Serine/threonine-protein kinase
Mol. Mass.:
41286.76
Organism:
Homo sapiens (Human)
Description:
Q16539
Residue:
360
  
Inhibitor
Name:
BDBM50153861
Synonyms:
3-Fluoro-N-[4-methyl-3-(2-methylsulfanyl-pyrimidin-4-ylamino)-phenyl]-5-morpholin-4-yl-benzamide | CHEMBL187857
Type:
Small organic molecule
Emp. Form.:
C23H24FN5O2S
Mol. Mass.:
453.532
SMILES:
CSc1nccc(Nc2cc(NC(=O)c3cc(F)cc(c3)N3CCOCC3)ccc2C)n1
: