Target
Epidermal growth factor receptor
Ligand
BDBM3532
Substrate
Meas. Tech.
ChEMBL_305999 (CHEMBL832673)
IC50
5±n/a nM
Citation
 Cumming, JGMcKenzie, CLBowden, SGCampbell, DMasters, DJBreed, JJewsbury, PJ Novel, potent and selective anilinoquinazoline and anilinopyrimidine inhibitors of p38 MAP kinase. Bioorg Med Chem Lett 14:5389-94 (2004)  
Target
Name:
Epidermal growth factor receptor
Synonyms:
EGF Receptor Substrate EGFR_HUMAN ERBB1 Epidermal Growth Factor Receptor erbB-1 Epidermal growth factor receptor (EGFR) HER1 Proto-oncogene c-ErbB-1 Tyrosine-Protein Kinase ErbB-1
Type:
Receptor Kinase Domain
Mol. Mass.:
134279.59
Organism:
Homo sapiens (Human)
Description:
P00533
Residue:
1210
  
Inhibitor
Name:
BDBM3532
Synonyms:
CHEMBL540068 N-(3-chlorophenyl)-6,7-dimethoxyquinazolin-4-amine | PD153035 Analog 31
Type:
Small organic molecule
Emp. Form.:
C16H14ClN3O2
Mol. Mass.:
315.754
SMILES:
COc1cc2ncnc(Nc3cccc(Cl)c3)c2cc1OC
: