Target
Cathepsin K
Ligand
BDBM50154149
Substrate
Meas. Tech.
ChEMBL_304938 (CHEMBL826967)
IC50
6.20±n/a nM
Citation
 Tavares, FXDeaton, DNMiller, ABMiller, LRWright, LLZhou, HQ Potent and selective ketoamide-based inhibitors of cysteine protease, cathepsin K. J Med Chem 47:5049-56 (2004)  
Target
Name:
Cathepsin K
Synonyms:
CATK_HUMAN CTSO Cathepsin O Cathepsin X
Type:
Enzyme
Mol. Mass.:
36975.68
Organism:
Homo sapiens (Human)
Description:
P43235
Residue:
329
  
Inhibitor
Name:
BDBM50154149
Synonyms:
CHEMBL183632 | [1-(5-Phenyl-1H-pyrazol-3-ylaminooxalyl)-pentyl]-carbamic acid 1-ethyl-cyclobutylmethyl ester
Type:
Small organic molecule
Emp. Form.:
C24H32N4O4
Mol. Mass.:
440.5353
SMILES:
CCCC[C@H](NC(=O)OCC1(CC)CCC1)C(=O)C(=O)Nc1cc(n[nH]1)-c1ccccc1
: