Target
5-hydroxytryptamine receptor 7
Ligand
BDBM50154716
Substrate
Meas. Tech.
ChEMBL_302663 (CHEMBL839951)
Ki
1±n/a nM
Citation
 Vermeulen, ESvan Smeden, MSchmidt, AWSprouse, JSWikström, HVGrol, CJ Novel 5-HT7 receptor inverse agonists. Synthesis and molecular modeling of arylpiperazine- and 1,2,3,4-tetrahydroisoquinoline-based arylsulfonamides. J Med Chem 47:5451-66 (2004)  
Target
Name:
5-hydroxytryptamine receptor 7
Synonyms:
5-HT-7 5-HT7 5-HT7S 5-hydroxytryptamine receptor 7 5HT7R_RAT GPRFO Serotonin (5-HT) receptor | Serotonin Receptor 7
Type:
G Protein-Coupled Receptor (GPCR)
Mol. Mass.:
49852.62
Organism:
Rattus norvegicus (rat)
Description:
Rat cloned 5-HT7R.
Residue:
448
  
Inhibitor
Name:
BDBM50154716
Synonyms:
(-)-1-Methyl-4-(8-methylsulfanyl-10,11-dihydro-dibenzo[b,f]thiepin-10-yl)-piperazine CHEMBL428892
Type:
Small organic molecule
Emp. Form.:
C20H24N2S2
Mol. Mass.:
356.548
SMILES:
CSc1ccc2Sc3ccccc3C[C@H](N3CCN(C)CC3)c2c1
: